Error C2864

RECOMMENDED: If you have Windows errors then we strongly recommend that you download and run this (Windows) Repair Tool.

Jul 10, 2013. Myclasses.h(86): error C2864: 'MyClass::floatvalue : only static. is recent enough) and -pedantic and you will (correctly) get an error. Of course, this shouldn't be done in a header, or you will get a multiple instance error.

The new home for Visual Studio documentation is Visual Studio 2017 Documentation on docs.microsoft.com. The latest version of this topic can be found at Compiler.

c++ – Resolving "only static const integral data members can be. – Jan 31, 2009. Just start from the top: 1>.test.cpp(15) : error C2864: 'Tester::number' : only static const integral data members can be initialized within a class.

Bypass System Error 5 Without Admin As a result, I can evaluate and deploy MBAM without. was really 2.5 SP1 RTM. original title: how do I run windows update troubleshooter as privileged user Clicking on windows update troubleshooter from the "Windows Help and Support" window is. Nessus Plugins Web Servers. Apache Tomcat 9.0.0M1. 9.0.0.M22 Multiple VulnerabilitiesApache Tomcat 8.5.x. 8.5.16 Multiple Vulnerabilities

The latest version of this topic can be found at Compiler Error C2864. variable’ : a static data member with an in-class initializer must have non-volatile const integral type

And how do I fix that "only static const integral data members can be initialized within a class". Error C2864: either add a const modifier to your integer,

int main() { cout << "Works"; return 0; }returns error C2864: ‘Player::name’ : only static const integral data members can be initialized within a class. What is wrong? This code compiled in Codeblocks IDE. Please explain to me what is.

. CRPCCtl’ : missing storage-class or type specifiers d:Odin_1ODIN_1OdinRPCvalidation.h(127) : error C2061: syntax error : identifier ‘CRPCCtl’ d:Odin_1ODIN_1OdinRPCvalidation.h(127) : error C2864: ‘m_crpcControlImpl’ :.

REP-1814: Report cannot be formatted. Object ‘vertically’ can never fit within – If you are lucky then simplest form of error might just mean that the object pointed out in error is going out of page boundary. If this does not help in resolving then analyze for following possible causes. 1.Find the anchoring objects.

visual studio compilation failure in x_tree. compilation error with VS. Error 23:error C2864. hpp:33 15:49 < SinisterMJ> This error doesn’t.

Error 3 error C2864: ‘Generator::c’ : only static const integral data members can be initialized within a class f:virtualdubroslogoawaydehazefilemain.cpp 100 dehaze.

Aug 14, 2012. returns error C2864: 'Player::name' : only static const integral data members can be initialized within a class. What is wrong? This code.

"Why" – well, it should be obvious, that's a C++11 feature that VS2012 doesn't support. There's no flag that you can use, add a constructor to that class.

Jul 4, 2012. This is not the way you initialize member variables in C++. You need to set the value in the init list of the constructor: Apple(int amount, int.

In the event of an error, we will not 654-147- assume responsibility for more. C2897 May3R WANTED TO BU- Y- Park Meadows home. C2864 April26R WANTED FIFTY PEOPLE WHO ARE INTERESTED IN LOSING WEIGHT ANO HAVING.

Compiler Errors C2800 Through C2899 Compiler Error C2864. Compiler Error C2864. Compiler Error C2864. Compiler Error C2800 · Compiler Error C2801.

cpp-docs – This repo moved to the MicrosoftDocs organization on June 23, 2017. Traffic to the previous URLs will be redirected here.

You attempted to initialize a data member that was not defined as const

92.3% Of Registry Cleaner Software failed our test. Which ones passed?

I have written mex which uses a set of c++ files and also instances.inc. But while compiling mex iam not. the issue. Error:- c:usersealiszedesktoppdbose code pumapumapumato_compile_mf2graph.h(392) : error C2864:.

RECOMMENDED: Click here to fix Windows errors and improve system performance