Error Loading Could Not Load File Or Assembly Unit Test

RECOMMENDED: If you have Windows errors then we strongly recommend that you download and run this (Windows) Repair Tool.

. Unit test error: Could not load file or assembly 'Microsoft.VisualStudio. Could not load file or assembly 'Microsoft.VisualStudio.

I have unit tests for my controllers (around 36). When I run them. I get same error for all the tests Unable to get type AdminPortal.Tests.Controller_Test.

Oct 04, 2010  · Whenever I try to save my Macro in Excel I get this error. Office isn’t very helpful, it told me to update windows which didn’t fix it. Google shows a lot of other.

Unit Test Runner failed to load test assembly – ReSharper Support. – Apr 28, 2011. Hello,I am unable to use Resharper's unit test runner anymore. I feel like the. This is the error message that I get is:. BadImageFormatException: Could not load file or assembly 'C:UsersrtaylorDocumentsVisual Studio.

Error 550 5.1.0 Well I have the same problem with 550 550 #5.1.0 Address rejected with my email, and Google is my email provider. 550 550 #5.1.0 Address rejected. Last updated 2015-10-23 This topic can help you fix email problems that are associated with error codes 550 5.1.1 through 5.1.20 if you see this in a. Describes delivery

ERROR CODE ERROR DESCRIPTION SOLUTION; 0: Normal Status: Normal Status: 400: Dark light sensor test error (CS11A, CS11B, CS4) during initializing. 1. Check if.

We have a huge list of what services on AWS are approved for us to build with, those that are not, and in between. The typical scenario is to create your own private one using approved Route53 that points to your ELB or ALB (load.

Error 4605 Clipboard This is a list of notable port numbers used by protocols of the transport layer of the Internet protocol suite for the establishment of host-to-host connectivity. Hello, I keep getting the following error while executing a macro: error 4605: This method or property is not available because the clipboard is empty or not va I
Error Analysis In English Ppt Even though she commits the same errors in both oral and written English, she often tries to. Let me start, then, with Corder's five steps in error analysis. A Non-Contrastive Approach to Error Analysis. – Richards, Jack C. TITLE. A Non-Contrastive Approach to Error Analysis. focuses on errors in learning English which do not derive

Arnia sector – Modi said goods from Saurashtra could be sent to ports in Visakhapatnam or Kolkata. The GSTN system is robust and load is not an issue. We are looking.

Jun 20, 2017. Test run failed with Could not load file or assembly 'Microsoft. Unspecified error (Exception from HRESULT: 0x80004005 (E_FAIL)) #203. Open. App.config file in unit test project causes the unit tests to not show up in text.

Reproducing the error in our development environment was pretty.

When I try to run my Unit Test project, I get the following error: Could not load file or assembly 'ASSEMBLY_NAME, Version=, Culture=neutral, PublicKeyToken.

Unit has a capacity of 12 or 15 cups (depending on the model); once the cups have been loaded and testing. file is loaded instantly. This removes the risk of.

Nov 3, 2011. After I deleted the *.accessor file, my test project stopped complaining and compiled succesfully. window), it usually states more clearly which file could not be found. There is a common error about executing unit tests : the execution folder. Maybe enabling assembly loading logging can give you a hint.

Mar 22, 2017. core, I cannot see the unit tests displayed in the Test Explorer window. This is the error that shows in the Tests window:. while test discoverer ' NUnit3TestDiscoverer' was loading tests. Exception: Could not load file or assembly 'System. NET Core changed the test adapter API, so the dotnet-test- nunit.

FileNotFoundException: Could not load file or assembly 'System.Web. Providers assembly is properly referenced in the unit test project (it's part of a NuGet.

catch { if($_.Exception.Message -match "Could not load file or assembly") { Write-Error -Message "Unable to load the SharePoint. cmdletbinding()] param([string]$CredentialName) #if( Test-Path variable:global:CredentialCache ) if( Get.

Oct 27, 2014. Running unit tests fails with error loading Microsoft.VisualStudio. FileNotFoundException: Could not load file or assembly 'Microsoft.

“For the RFB in particular, getting the forward ejection to work took trial and error; if there is too much bolt velocity, the firearm will jam, if not enough, the carbine won’t extract properly. It took quite a bit of testing and re-testing to get it.

RECOMMENDED: Click here to fix Windows errors and improve system performance